Details

    • Type: Story Story
    • Status: Closed Closed
    • Priority: Major Major
    • Resolution: Won't Fix
    • Affects Version/s: None
    • Fix Version/s: CM-2.0 M3-Sprint 1
    • Component/s: PDT Development
    • Security Level: Public (Public: Anyone can view)
    • Labels:
      None
    • Business Value:
      20

      Description

      Running org.kuali.student.r2.core.atp.TestAtpService
      log4j: Parsing for [root] with value=[WARN, console].
      log4j: Level token is [WARN].
      log4j: Category root set to WARN
      log4j: Parsing appender named "console".
      log4j: Parsing layout options for "console".
      log4j: Setting property [conversionPattern] to [%-4r [%t] %-5p %c %x - %m%n].
      log4j: End of parsing for "console".
      log4j: Setting property [threshold] to [WARN].
      log4j: Parsed "console" options.
      log4j: Parsing for [org.springframework] with value=[WARN].
      log4j: Level token is [WARN].
      log4j: Category org.springframework set to WARN
      log4j: Handling log4j.additivity.org.springframework=[null]
      log4j: Parsing for [atomikos] with value=[WARN].
      log4j: Level token is [WARN].
      log4j: Category atomikos set to WARN
      log4j: Handling log4j.additivity.atomikos=[null]
      log4j: Finished configuring.
      0 [main] WARN org.kuali.student.common.util.ModPropertyPlaceholderConfigurer - Could not load custom properties from property:ks.config.location location:null
      386 [main] WARN org.springframework.beans.factory.support.DisposableBeanAdapter - Invocation of destroy method 'shutdown' failed on bean with name 'cxf': org.springframework.beans.factory.CannotLoadBeanClassException: Cannot find class [org.kuali.student.r1.common.validator.ValidatorFactory] for bean with name 'validatorFactory' defined in class path resource [atp-additional-context.xml]; nested exception is java.lang.ClassNotFoundException: org.kuali.student.r1.common.validator.ValidatorFactory
      388 [main] ERROR org.springframework.web.context.ContextLoader - Context initialization failed
      org.springframework.beans.factory.BeanCreationException: Error creating bean with name 'org.apache.cxf.transport.servlet.ServletTransportFactory' defined in class path resource [META-INF/cxf/cxf-servlet.xml]: Error setting property values; nested exception is org.springframework.beans.PropertyBatchUpdateException; nested PropertyAccessExceptions (2) are:
      PropertyAccessException 1: org.springframework.beans.MethodInvocationException: Property 'bus' threw exception; nested exception is org.springframework.beans.factory.CannotLoadBeanClassException: Cannot find class [org.kuali.student.r1.common.validator.ValidatorFactory] for bean with name 'validatorFactory' defined in class path resource [atp-additional-context.xml]; nested exception is java.lang.ClassNotFoundException: org.kuali.student.r1.common.validator.ValidatorFactory
      PropertyAccessException 2: org.springframework.beans.MethodInvocationException: Property 'transportIds' threw exception; nested exception is org.springframework.beans.factory.CannotLoadBeanClassException: Cannot find class [org.kuali.student.r1.common.validator.ValidatorFactory] for bean with name 'validatorFactory' defined in class path resource [atp-additional-context.xml]; nested exception is java.lang.ClassNotFoundException: org.kuali.student.r1.common.validator.ValidatorFactory
      at org.springframework.beans.factory.support.AbstractAutowireCapableBeanFactory.applyPropertyValues(AbstractAutowireCapableBeanFactory.java:1396)
      at org.springframework.beans.factory.support.AbstractAutowireCapableBeanFactory.populateBean(AbstractAutowireCapableBeanFactory.java:1118)
      at org.springframework.beans.factory.support.AbstractAutowireCapableBeanFactory.doCreateBean(AbstractAutowireCapableBeanFactory.java:517)
      at org.springframework.beans.factory.support.AbstractAutowireCapableBeanFactory.createBean(AbstractAutowireCapableBeanFactory.java:456)
      at org.springframework.beans.factory.support.AbstractBeanFactory$1.getObject(AbstractBeanFactory.java:294)
      at org.springframework.beans.factory.support.DefaultSingletonBeanRegistry.getSingleton(DefaultSingletonBeanRegistry.java:225)
      at org.springframework.beans.factory.support.AbstractBeanFactory.doGetBean(AbstractBeanFactory.java:291)
      at org.springframework.beans.factory.support.AbstractBeanFactory.getBean(AbstractBeanFactory.java:193)
      at org.springframework.beans.factory.support.DefaultListableBeanFactory.preInstantiateSingletons(DefaultListableBeanFactory.java:585)
      at org.springframework.context.support.AbstractApplicationContext.finishBeanFactoryInitialization(AbstractApplicationContext.java:913)
      at org.springframework.context.support.AbstractApplicationContext.refresh(AbstractApplicationContext.java:464)
      at org.springframework.web.context.ContextLoader.configureAndRefreshWebApplicationContext(ContextLoader.java:384)
      at org.springframework.web.context.ContextLoader.initWebApplicationContext(ContextLoader.java:283)
      at org.springframework.web.context.ContextLoaderListener.contextInitialized(ContextLoaderListener.java:111)
      at org.mortbay.jetty.handler.ContextHandler.startContext(ContextHandler.java:539)
      at org.mortbay.jetty.servlet.Context.startContext(Context.java:135)
      at org.mortbay.jetty.handler.ContextHandler.doStart(ContextHandler.java:509)
      at org.mortbay.component.AbstractLifeCycle.start(AbstractLifeCycle.java:40)
      at org.mortbay.jetty.handler.HandlerWrapper.doStart(HandlerWrapper.java:117)
      at org.mortbay.jetty.Server.doStart(Server.java:222)
      at org.mortbay.component.AbstractLifeCycle.start(AbstractLifeCycle.java:40)
      at org.kuali.student.common.test.spring.ServiceTestClassRunner.startServer(ServiceTestClassRunner.java:235)
      at org.kuali.student.common.test.spring.ServiceTestClassRunner.run(ServiceTestClassRunner.java:249)
      at org.apache.maven.surefire.junit4.JUnit4TestSet.execute(JUnit4TestSet.java:53)
      at org.apache.maven.surefire.junit4.JUnit4Provider.executeTestSet(JUnit4Provider.java:119)
      at org.apache.maven.surefire.junit4.JUnit4Provider.invoke(JUnit4Provider.java:101)
      at sun.reflect.NativeMethodAccessorImpl.invoke0(Native Method)
      at sun.reflect.NativeMethodAccessorImpl.invoke(NativeMethodAccessorImpl.java:39)
      at sun.reflect.DelegatingMethodAccessorImpl.invoke(DelegatingMethodAccessorImpl.java:25)
      at java.lang.reflect.Method.invoke(Method.java:597)
      at org.apache.maven.surefire.booter.ProviderFactory$ClassLoaderProxy.invoke(ProviderFactory.java:103)
      at $Proxy0.invoke(Unknown Source)
      at org.apache.maven.surefire.booter.SurefireStarter.invokeProvider(SurefireStarter.java:150)
      at org.apache.maven.surefire.booter.SurefireStarter.runSuitesInProcess(SurefireStarter.java:74)
      at org.apache.maven.surefire.booter.ForkedBooter.main(ForkedBooter.java:69)
      Caused by: org.springframework.beans.PropertyBatchUpdateException; nested PropertyAccessExceptions (2) are:
      PropertyAccessException 1: org.springframework.beans.MethodInvocationException: Property 'bus' threw exception; nested exception is org.springframework.beans.factory.CannotLoadBeanClassException: Cannot find class [org.kuali.student.r1.common.validator.ValidatorFactory] for bean with name 'validatorFactory' defined in class path resource [atp-additional-context.xml]; nested exception is java.lang.ClassNotFoundException: org.kuali.student.r1.common.validator.ValidatorFactory
      PropertyAccessException 2: org.springframework.beans.MethodInvocationException: Property 'transportIds' threw exception; nested exception is org.springframework.beans.factory.CannotLoadBeanClassException: Cannot find class [org.kuali.student.r1.common.validator.ValidatorFactory] for bean with name 'validatorFactory' defined in class path resource [atp-additional-context.xml]; nested exception is java.lang.ClassNotFoundException: org.kuali.student.r1.common.validator.ValidatorFactory
      at org.springframework.beans.AbstractPropertyAccessor.setPropertyValues(AbstractPropertyAccessor.java:102)
      at org.springframework.beans.AbstractPropertyAccessor.setPropertyValues(AbstractPropertyAccessor.java:58)
      at org.springframework.beans.factory.support.AbstractAutowireCapableBeanFactory.applyPropertyValues(AbstractAutowireCapableBeanFactory.java:1393)
      ... 34 more
      394 [main] ERROR org.mortbay.log - failed org.mortbay.jetty.servlet.Context@66178655

      {/Service,file:/C:/Kuali/Projects/E37Wkspaces/CM2UI/ks-2.0-cmNew/ks-core/ks-core-impl/src/test/resources/}

      org.springframework.beans.factory.BeanCreationException: Error creating bean with name 'org.apache.cxf.transport.servlet.ServletTransportFactory' defined in class path resource [META-INF/cxf/cxf-servlet.xml]: Error setting property values; nested exception is org.springframework.beans.PropertyBatchUpdateException; nested PropertyAccessExceptions (2) are:
      PropertyAccessException 1: org.springframework.beans.MethodInvocationException: Property 'bus' threw exception; nested exception is org.springframework.beans.factory.CannotLoadBeanClassException: Cannot find class [org.kuali.student.r1.common.validator.ValidatorFactory] for bean with name 'validatorFactory' defined in class path resource [atp-additional-context.xml]; nested exception is java.lang.ClassNotFoundException: org.kuali.student.r1.common.validator.ValidatorFactory
      PropertyAccessException 2: org.springframework.beans.MethodInvocationException: Property 'transportIds' threw exception; nested exception is org.springframework.beans.factory.CannotLoadBeanClassException: Cannot find class [org.kuali.student.r1.common.validator.ValidatorFactory] for bean with name 'validatorFactory' defined in class path resource [atp-additional-context.xml]; nested exception is java.lang.ClassNotFoundException: org.kuali.student.r1.common.validator.ValidatorFactory
      at org.springframework.beans.factory.support.AbstractAutowireCapableBeanFactory.applyPropertyValues(AbstractAutowireCapableBeanFactory.java:1396)
      at org.springframework.beans.factory.support.AbstractAutowireCapableBeanFactory.populateBean(AbstractAutowireCapableBeanFactory.java:1118)
      at org.springframework.beans.factory.support.AbstractAutowireCapableBeanFactory.doCreateBean(AbstractAutowireCapableBeanFactory.java:517)
      at org.springframework.beans.factory.support.AbstractAutowireCapableBeanFactory.createBean(AbstractAutowireCapableBeanFactory.java:456)
      at org.springframework.beans.factory.support.AbstractBeanFactory$1.getObject(AbstractBeanFactory.java:294)
      at org.springframework.beans.factory.support.DefaultSingletonBeanRegistry.getSingleton(DefaultSingletonBeanRegistry.java:225)
      at org.springframework.beans.factory.support.AbstractBeanFactory.doGetBean(AbstractBeanFactory.java:291)
      at org.springframework.beans.factory.support.AbstractBeanFactory.getBean(AbstractBeanFactory.java:193)
      at org.springframework.beans.factory.support.DefaultListableBeanFactory.preInstantiateSingletons(DefaultListableBeanFactory.java:585)
      at org.springframework.context.support.AbstractApplicationContext.finishBeanFactoryInitialization(AbstractApplicationContext.java:913)
      at org.springframework.context.support.AbstractApplicationContext.refresh(AbstractApplicationContext.java:464)
      at org.springframework.web.context.ContextLoader.configureAndRefreshWebApplicationContext(ContextLoader.java:384)
      at org.springframework.web.context.ContextLoader.initWebApplicationContext(ContextLoader.java:283)
      at org.springframework.web.context.ContextLoaderListener.contextInitialized(ContextLoaderListener.java:111)
      at org.mortbay.jetty.handler.ContextHandler.startContext(ContextHandler.java:539)
      at org.mortbay.jetty.servlet.Context.startContext(Context.java:135)
      at org.mortbay.jetty.handler.ContextHandler.doStart(ContextHandler.java:509)
      at org.mortbay.component.AbstractLifeCycle.start(AbstractLifeCycle.java:40)
      at org.mortbay.jetty.handler.HandlerWrapper.doStart(HandlerWrapper.java:117)
      at org.mortbay.jetty.Server.doStart(Server.java:222)
      at org.mortbay.component.AbstractLifeCycle.start(AbstractLifeCycle.java:40)
      at org.kuali.student.common.test.spring.ServiceTestClassRunner.startServer(ServiceTestClassRunner.java:235)
      at org.kuali.student.common.test.spring.ServiceTestClassRunner.run(ServiceTestClassRunner.java:249)
      at org.apache.maven.surefire.junit4.JUnit4TestSet.execute(JUnit4TestSet.java:53)
      at org.apache.maven.surefire.junit4.JUnit4Provider.executeTestSet(JUnit4Provider.java:119)
      at org.apache.maven.surefire.junit4.JUnit4Provider.invoke(JUnit4Provider.java:101)
      at sun.reflect.NativeMethodAccessorImpl.invoke0(Native Method)
      at sun.reflect.NativeMethodAccessorImpl.invoke(NativeMethodAccessorImpl.java:39)
      at sun.reflect.DelegatingMethodAccessorImpl.invoke(DelegatingMethodAccessorImpl.java:25)
      at java.lang.reflect.Method.invoke(Method.java:597)
      at org.apache.maven.surefire.booter.ProviderFactory$ClassLoaderProxy.invoke(ProviderFactory.java:103)
      at $Proxy0.invoke(Unknown Source)
      at org.apache.maven.surefire.booter.SurefireStarter.invokeProvider(SurefireStarter.java:150)
      at org.apache.maven.surefire.booter.SurefireStarter.runSuitesInProcess(SurefireStarter.java:74)
      at org.apache.maven.surefire.booter.ForkedBooter.main(ForkedBooter.java:69)
      Caused by: org.springframework.beans.PropertyBatchUpdateException; nested PropertyAccessExceptions (2) are:
      PropertyAccessException 1: org.springframework.beans.MethodInvocationException: Property 'bus' threw exception; nested exception is org.springframework.beans.factory.CannotLoadBeanClassException: Cannot find class [org.kuali.student.r1.common.validator.ValidatorFactory] for bean with name 'validatorFactory' defined in class path resource [atp-additional-context.xml]; nested exception is java.lang.ClassNotFoundException: org.kuali.student.r1.common.validator.ValidatorFactory
      PropertyAccessException 2: org.springframework.beans.MethodInvocationException: Property 'transportIds' threw exception; nested exception is org.springframework.beans.factory.CannotLoadBeanClassException: Cannot find class [org.kuali.student.r1.common.validator.ValidatorFactory] for bean with name 'validatorFactory' defined in class path resource [atp-additional-context.xml]; nested exception is java.lang.ClassNotFoundException: org.kuali.student.r1.common.validator.ValidatorFactory
      at org.springframework.beans.AbstractPropertyAccessor.setPropertyValues(AbstractPropertyAccessor.java:102)
      at org.springframework.beans.AbstractPropertyAccessor.setPropertyValues(AbstractPropertyAccessor.java:58)
      at org.springframework.beans.factory.support.AbstractAutowireCapableBeanFactory.applyPropertyValues(AbstractAutowireCapableBeanFactory.java:1393)
      ... 34 more
      397 [main] ERROR org.mortbay.log - Nested in org.springframework.beans.factory.BeanCreationException: Error creating bean with name 'org.apache.cxf.transport.servlet.ServletTransportFactory' defined in class path resource [META-INF/cxf/cxf-servlet.xml]: Error setting property values; nested exception is org.springframework.beans.PropertyBatchUpdateException; nested PropertyAccessExceptions (2) are:
      PropertyAccessException 1: org.springframework.beans.MethodInvocationException: Property 'bus' threw exception; nested exception is org.springframework.beans.factory.CannotLoadBeanClassException: Cannot find class [org.kuali.student.r1.common.validator.ValidatorFactory] for bean with name 'validatorFactory' defined in class path resource [atp-additional-context.xml]; nested exception is java.lang.ClassNotFoundException: org.kuali.student.r1.common.validator.ValidatorFactory
      PropertyAccessException 2: org.springframework.beans.MethodInvocationException: Property 'transportIds' threw exception; nested exception is org.springframework.beans.factory.CannotLoadBeanClassException: Cannot find class [org.kuali.student.r1.common.validator.ValidatorFactory] for bean with name 'validatorFactory' defined in class path resource [atp-additional-context.xml]; nested exception is java.lang.ClassNotFoundException: org.kuali.student.r1.common.validator.ValidatorFactory:
      org.springframework.beans.PropertyBatchUpdateException; nested PropertyAccessException details (2) are:
      PropertyAccessException 1:
      org.springframework.beans.MethodInvocationException: Property 'bus' threw exception; nested exception is org.springframework.beans.factory.CannotLoadBeanClassException: Cannot find class [org.kuali.student.r1.common.validator.ValidatorFactory] for bean with name 'validatorFactory' defined in class path resource [atp-additional-context.xml]; nested exception is java.lang.ClassNotFoundException: org.kuali.student.r1.common.validator.ValidatorFactory
      at org.springframework.beans.BeanWrapperImpl.setPropertyValue(BeanWrapperImpl.java:1167)
      at org.springframework.beans.BeanWrapperImpl.setPropertyValue(BeanWrapperImpl.java:924)
      at org.springframework.beans.AbstractPropertyAccessor.setPropertyValues(AbstractPropertyAccessor.java:76)
      at org.springframework.beans.AbstractPropertyAccessor.setPropertyValues(AbstractPropertyAccessor.java:58)
      at org.springframework.beans.factory.support.AbstractAutowireCapableBeanFactory.applyPropertyValues(AbstractAutowireCapableBeanFactory.java:1393)
      at org.springframework.beans.factory.support.AbstractAutowireCapableBeanFactory.populateBean(AbstractAutowireCapableBeanFactory.java:1118)
      at org.springframework.beans.factory.support.AbstractAutowireCapableBeanFactory.doCreateBean(AbstractAutowireCapableBeanFactory.java:517)
      at org.springframework.beans.factory.support.AbstractAutowireCapableBeanFactory.createBean(AbstractAutowireCapableBeanFactory.java:456)
      at org.springframework.beans.factory.support.AbstractBeanFactory$1.getObject(AbstractBeanFactory.java:294)
      at org.springframework.beans.factory.support.DefaultSingletonBeanRegistry.getSingleton(DefaultSingletonBeanRegistry.java:225)
      at org.springframework.beans.factory.support.AbstractBeanFactory.doGetBean(AbstractBeanFactory.java:291)
      at org.springframework.beans.factory.support.AbstractBeanFactory.getBean(AbstractBeanFactory.java:193)
      at org.springframework.beans.factory.support.DefaultListableBeanFactory.preInstantiateSingletons(DefaultListableBeanFactory.java:585)
      at org.springframework.context.support.AbstractApplicationContext.finishBeanFactoryInitialization(AbstractApplicationContext.java:913)
      at org.springframework.context.support.AbstractApplicationContext.refresh(AbstractApplicationContext.java:464)
      at org.springframework.web.context.ContextLoader.configureAndRefreshWebApplicationContext(ContextLoader.java:384)
      at org.springframework.web.context.ContextLoader.initWebApplicationContext(ContextLoader.java:283)
      at org.springframework.web.context.ContextLoaderListener.contextInitialized(ContextLoaderListener.java:111)
      at org.mortbay.jetty.handler.ContextHandler.startContext(ContextHandler.java:539)
      at org.mortbay.jetty.servlet.Context.startContext(Context.java:135)
      at org.mortbay.jetty.handler.ContextHandler.doStart(ContextHandler.java:509)
      at org.mortbay.component.AbstractLifeCycle.start(AbstractLifeCycle.java:40)
      at org.mortbay.jetty.handler.HandlerWrapper.doStart(HandlerWrapper.java:117)
      at org.mortbay.jetty.Server.doStart(Server.java:222)
      at org.mortbay.component.AbstractLifeCycle.start(AbstractLifeCycle.java:40)
      at org.kuali.student.common.test.spring.ServiceTestClassRunner.startServer(ServiceTestClassRunner.java:235)
      at org.kuali.student.common.test.spring.ServiceTestClassRunner.run(ServiceTestClassRunner.java:249)
      at org.apache.maven.surefire.junit4.JUnit4TestSet.execute(JUnit4TestSet.java:53)
      at org.apache.maven.surefire.junit4.JUnit4Provider.executeTestSet(JUnit4Provider.java:119)
      at org.apache.maven.surefire.junit4.JUnit4Provider.invoke(JUnit4Provider.java:101)
      at sun.reflect.NativeMethodAccessorImpl.invoke0(Native Method)
      at sun.reflect.NativeMethodAccessorImpl.invoke(NativeMethodAccessorImpl.java:39)
      at sun.reflect.DelegatingMethodAccessorImpl.invoke(DelegatingMethodAccessorImpl.java:25)
      at java.lang.reflect.Method.invoke(Method.java:597)
      at org.apache.maven.surefire.booter.ProviderFactory$ClassLoaderProxy.invoke(ProviderFactory.java:103)
      at $Proxy0.invoke(Unknown Source)
      at org.apache.maven.surefire.booter.SurefireStarter.invokeProvider(SurefireStarter.java:150)
      at org.apache.maven.surefire.booter.SurefireStarter.runSuitesInProcess(SurefireStarter.java:74)
      at org.apache.maven.surefire.booter.ForkedBooter.main(ForkedBooter.java:69)
      Caused by: org.springframework.beans.factory.CannotLoadBeanClassException: Cannot find class [org.kuali.student.r1.common.validator.ValidatorFactory] for bean with name 'validatorFactory' defined in class path resource [atp-additional-context.xml]; nested exception is java.lang.ClassNotFoundException: org.kuali.student.r1.common.validator.ValidatorFactory
      at org.springframework.beans.factory.support.AbstractBeanFactory.resolveBeanClass(AbstractBeanFactory.java:1262)
      at org.springframework.beans.factory.support.AbstractAutowireCapableBeanFactory.predictBeanType(AbstractAutowireCapableBeanFactory.java:576)
      at org.springframework.beans.factory.support.AbstractBeanFactory.isFactoryBean(AbstractBeanFactory.java:1331)
      at org.springframework.beans.factory.support.DefaultListableBeanFactory.getBeanNamesForType(DefaultListableBeanFactory.java:317)
      at org.springframework.beans.factory.support.DefaultListableBeanFactory.getBeansOfType(DefaultListableBeanFactory.java:396)
      at org.springframework.context.support.AbstractApplicationContext.getBeansOfType(AbstractApplicationContext.java:1164)
      at org.apache.cxf.bus.spring.SpringBeanLocator.getBeansOfType(SpringBeanLocator.java:59)
      at org.apache.cxf.bus.CXFBusImpl.getExtension(CXFBusImpl.java:99)
      at org.apache.cxf.transport.AbstractTransportFactory.register(AbstractTransportFactory.java:72)
      at org.apache.cxf.transport.AbstractTransportFactory.setBus(AbstractTransportFactory.java:50)
      at org.apache.cxf.transport.servlet.ServletTransportFactory.setBus(ServletTransportFactory.java:73)
      at sun.reflect.NativeMethodAccessorImpl.invoke0(Native Method)
      at sun.reflect.NativeMethodAccessorImpl.invoke(NativeMethodAccessorImpl.java:39)
      at sun.reflect.DelegatingMethodAccessorImpl.invoke(DelegatingMethodAccessorImpl.java:25)
      at java.lang.reflect.Method.invoke(Method.java:597)
      at org.springframework.beans.BeanWrapperImpl.setPropertyValue(BeanWrapperImpl.java:1154)
      ... 38 more
      Caused by: java.lang.ClassNotFoundException: org.kuali.student.r1.common.validator.ValidatorFactory
      at java.net.URLClassLoader$1.run(URLClassLoader.java:202)
      at java.security.AccessController.doPrivileged(Native Method)
      at java.net.URLClassLoader.findClass(URLClassLoader.java:190)
      at java.lang.ClassLoader.loadClass(ClassLoader.java:307)
      at sun.misc.Launcher$AppClassLoader.loadClass(Launcher.java:301)
      at java.lang.ClassLoader.loadClass(ClassLoader.java:248)
      at org.springframework.util.ClassUtils.forName(ClassUtils.java:257)
      at org.springframework.beans.factory.support.AbstractBeanDefinition.resolveBeanClass(AbstractBeanDefinition.java:417)
      at org.springframework.beans.factory.support.AbstractBeanFactory.doResolveBeanClass(AbstractBeanFactory.java:1283)
      at org.springframework.beans.factory.support.AbstractBeanFactory.resolveBeanClass(AbstractBeanFactory.java:1254)
      ... 53 more
      PropertyAccessException 2:
      org.springframework.beans.MethodInvocationException: Property 'transportIds' threw exception; nested exception is org.springframework.beans.factory.CannotLoadBeanClassException: Cannot find class [org.kuali.student.r1.common.validator.ValidatorFactory] for bean with name 'validatorFactory' defined in class path resource [atp-additional-context.xml]; nested exception is java.lang.ClassNotFoundException: org.kuali.student.r1.common.validator.ValidatorFactory
      at org.springframework.beans.BeanWrapperImpl.setPropertyValue(BeanWrapperImpl.java:1167)
      at org.springframework.beans.BeanWrapperImpl.setPropertyValue(BeanWrapperImpl.java:924)
      at org.springframework.beans.AbstractPropertyAccessor.setPropertyValues(AbstractPropertyAccessor.java:76)
      at org.springframework.beans.AbstractPropertyAccessor.setPropertyValues(AbstractPropertyAccessor.java:58)
      at org.springframework.beans.factory.support.AbstractAutowireCapableBeanFactory.applyPropertyValues(AbstractAutowireCapableBeanFactory.java:1393)
      at org.springframework.beans.factory.support.AbstractAutowireCapableBeanFactory.populateBean(AbstractAutowireCapableBeanFactory.java:1118)
      at org.springframework.beans.factory.support.AbstractAutowireCapableBeanFactory.doCreateBean(AbstractAutowireCapableBeanFactory.java:517)
      at org.springframework.beans.factory.support.AbstractAutowireCapableBeanFactory.createBean(AbstractAutowireCapableBeanFactory.java:456)
      at org.springframework.beans.factory.support.AbstractBeanFactory$1.getObject(AbstractBeanFactory.java:294)
      at org.springframework.beans.factory.support.DefaultSingletonBeanRegistry.getSingleton(DefaultSingletonBeanRegistry.java:225)
      at org.springframework.beans.factory.support.AbstractBeanFactory.doGetBean(AbstractBeanFactory.java:291)
      at org.springframework.beans.factory.support.AbstractBeanFactory.getBean(AbstractBeanFactory.java:193)
      at org.springframework.beans.factory.support.DefaultListableBeanFactory.preInstantiateSingletons(DefaultListableBeanFactory.java:585)
      at org.springframework.context.support.AbstractApplicationContext.finishBeanFactoryInitialization(AbstractApplicationContext.java:913)
      at org.springframework.context.support.AbstractApplicationContext.refresh(AbstractApplicationContext.java:464)
      at org.springframework.web.context.ContextLoader.configureAndRefreshWebApplicationContext(ContextLoader.java:384)
      at org.springframework.web.context.ContextLoader.initWebApplicationContext(ContextLoader.java:283)
      at org.springframework.web.context.ContextLoaderListener.contextInitialized(ContextLoaderListener.java:111)
      at org.mortbay.jetty.handler.ContextHandler.startContext(ContextHandler.java:539)
      at org.mortbay.jetty.servlet.Context.startContext(Context.java:135)
      at org.mortbay.jetty.handler.ContextHandler.doStart(ContextHandler.java:509)
      at org.mortbay.component.AbstractLifeCycle.start(AbstractLifeCycle.java:40)
      at org.mortbay.jetty.handler.HandlerWrapper.doStart(HandlerWrapper.java:117)
      at org.mortbay.jetty.Server.doStart(Server.java:222)
      at org.mortbay.component.AbstractLifeCycle.start(AbstractLifeCycle.java:40)
      at org.kuali.student.common.test.spring.ServiceTestClassRunner.startServer(ServiceTestClassRunner.java:235)
      at org.kuali.student.common.test.spring.ServiceTestClassRunner.run(ServiceTestClassRunner.java:249)
      at org.apache.maven.surefire.junit4.JUnit4TestSet.execute(JUnit4TestSet.java:53)
      at org.apache.maven.surefire.junit4.JUnit4Provider.executeTestSet(JUnit4Provider.java:119)
      at org.apache.maven.surefire.junit4.JUnit4Provider.invoke(JUnit4Provider.java:101)
      at sun.reflect.NativeMethodAccessorImpl.invoke0(Native Method)
      at sun.reflect.NativeMethodAccessorImpl.invoke(NativeMethodAccessorImpl.java:39)
      at sun.reflect.DelegatingMethodAccessorImpl.invoke(DelegatingMethodAccessorImpl.java:25)
      at java.lang.reflect.Method.invoke(Method.java:597)
      at org.apache.maven.surefire.booter.ProviderFactory$ClassLoaderProxy.invoke(ProviderFactory.java:103)
      at $Proxy0.invoke(Unknown Source)
      at org.apache.maven.surefire.booter.SurefireStarter.invokeProvider(SurefireStarter.java:150)
      at org.apache.maven.surefire.booter.SurefireStarter.runSuitesInProcess(SurefireStarter.java:74)
      at org.apache.maven.surefire.booter.ForkedBooter.main(ForkedBooter.java:69)
      Caused by: org.springframework.beans.factory.CannotLoadBeanClassException: Cannot find class [org.kuali.student.r1.common.validator.ValidatorFactory] for bean with name 'validatorFactory' defined in class path resource [atp-additional-context.xml]; nested exception is java.lang.ClassNotFoundException: org.kuali.student.r1.common.validator.ValidatorFactory
      at org.springframework.beans.factory.support.AbstractBeanFactory.resolveBeanClass(AbstractBeanFactory.java:1262)
      at org.springframework.beans.factory.support.AbstractAutowireCapableBeanFactory.predictBeanType(AbstractAutowireCapableBeanFactory.java:576)
      at org.springframework.beans.factory.support.AbstractBeanFactory.isFactoryBean(AbstractBeanFactory.java:1331)
      at org.springframework.beans.factory.support.DefaultListableBeanFactory.getBeanNamesForType(DefaultListableBeanFactory.java:317)
      at org.springframework.beans.factory.support.DefaultListableBeanFactory.getBeansOfType(DefaultListableBeanFactory.java:396)
      at org.springframework.context.support.AbstractApplicationContext.getBeansOfType(AbstractApplicationContext.java:1164)
      at org.apache.cxf.bus.spring.SpringBeanLocator.getBeansOfType(SpringBeanLocator.java:59)
      at org.apache.cxf.bus.CXFBusImpl.getExtension(CXFBusImpl.java:99)
      at org.apache.cxf.transport.AbstractTransportFactory.unregister(AbstractTransportFactory.java:93)
      at org.apache.cxf.transport.AbstractTransportFactory.setTransportIds(AbstractTransportFactory.java:58)
      at sun.reflect.NativeMethodAccessorImpl.invoke0(Native Method)
      at sun.reflect.NativeMethodAccessorImpl.invoke(NativeMethodAccessorImpl.java:39)
      at sun.reflect.DelegatingMethodAccessorImpl.invoke(DelegatingMethodAccessorImpl.java:25)
      at java.lang.reflect.Method.invoke(Method.java:597)
      at org.springframework.beans.BeanWrapperImpl.setPropertyValue(BeanWrapperImpl.java:1154)
      ... 38 more
      Caused by: java.lang.ClassNotFoundException: org.kuali.student.r1.common.validator.ValidatorFactory
      at java.net.URLClassLoader$1.run(URLClassLoader.java:202)
      at java.security.AccessController.doPrivileged(Native Method)
      at java.net.URLClassLoader.findClass(URLClassLoader.java:190)
      at java.lang.ClassLoader.loadClass(ClassLoader.java:307)
      at sun.misc.Launcher$AppClassLoader.loadClass(Launcher.java:301)
      at java.lang.ClassLoader.loadClass(ClassLoader.java:248)
      at org.springframework.util.ClassUtils.forName(ClassUtils.java:257)
      at org.springframework.beans.factory.support.AbstractBeanDefinition.resolveBeanClass(AbstractBeanDefinition.java:417)
      at org.springframework.beans.factory.support.AbstractBeanFactory.doResolveBeanClass(AbstractBeanFactory.java:1283)
      at org.springframework.beans.factory.support.AbstractBeanFactory.resolveBeanClass(AbstractBeanFactory.java:1254)
      ... 52 more
      402 [main] ERROR org.mortbay.log - Error starting handlers
      org.springframework.beans.factory.BeanCreationException: Error creating bean with name 'org.apache.cxf.transport.servlet.ServletTransportFactory' defined in class path resource [META-INF/cxf/cxf-servlet.xml]: Error setting property values; nested exception is org.springframework.beans.PropertyBatchUpdateException; nested PropertyAccessExceptions (2) are:
      PropertyAccessException 1: org.springframework.beans.MethodInvocationException: Property 'bus' threw exception; nested exception is org.springframework.beans.factory.CannotLoadBeanClassException: Cannot find class [org.kuali.student.r1.common.validator.ValidatorFactory] for bean with name 'validatorFactory' defined in class path resource [atp-additional-context.xml]; nested exception is java.lang.ClassNotFoundException: org.kuali.student.r1.common.validator.ValidatorFactory
      PropertyAccessException 2: org.springframework.beans.MethodInvocationException: Property 'transportIds' threw exception; nested exception is org.springframework.beans.factory.CannotLoadBeanClassException: Cannot find class [org.kuali.student.r1.common.validator.ValidatorFactory] for bean with name 'validatorFactory' defined in class path resource [atp-additional-context.xml]; nested exception is java.lang.ClassNotFoundException: org.kuali.student.r1.common.validator.ValidatorFactory
      at org.springframework.beans.factory.support.AbstractAutowireCapableBeanFactory.applyPropertyValues(AbstractAutowireCapableBeanFactory.java:1396)
      at org.springframework.beans.factory.support.AbstractAutowireCapableBeanFactory.populateBean(AbstractAutowireCapableBeanFactory.java:1118)
      at org.springframework.beans.factory.support.AbstractAutowireCapableBeanFactory.doCreateBean(AbstractAutowireCapableBeanFactory.java:517)
      at org.springframework.beans.factory.support.AbstractAutowireCapableBeanFactory.createBean(AbstractAutowireCapableBeanFactory.java:456)
      at org.springframework.beans.factory.support.AbstractBeanFactory$1.getObject(AbstractBeanFactory.java:294)
      at org.springframework.beans.factory.support.DefaultSingletonBeanRegistry.getSingleton(DefaultSingletonBeanRegistry.java:225)
      at org.springframework.beans.factory.support.AbstractBeanFactory.doGetBean(AbstractBeanFactory.java:291)
      at org.springframework.beans.factory.support.AbstractBeanFactory.getBean(AbstractBeanFactory.java:193)
      at org.springframework.beans.factory.support.DefaultListableBeanFactory.preInstantiateSingletons(DefaultListableBeanFactory.java:585)
      at org.springframework.context.support.AbstractApplicationContext.finishBeanFactoryInitialization(AbstractApplicationContext.java:913)
      at org.springframework.context.support.AbstractApplicationContext.refresh(AbstractApplicationContext.java:464)
      at org.springframework.web.context.ContextLoader.configureAndRefreshWebApplicationContext(ContextLoader.java:384)
      at org.springframework.web.context.ContextLoader.initWebApplicationContext(ContextLoader.java:283)
      at org.springframework.web.context.ContextLoaderListener.contextInitialized(ContextLoaderListener.java:111)
      at org.mortbay.jetty.handler.ContextHandler.startContext(ContextHandler.java:539)
      at org.mortbay.jetty.servlet.Context.startContext(Context.java:135)
      at org.mortbay.jetty.handler.ContextHandler.doStart(ContextHandler.java:509)
      at org.mortbay.component.AbstractLifeCycle.start(AbstractLifeCycle.java:40)
      at org.mortbay.jetty.handler.HandlerWrapper.doStart(HandlerWrapper.java:117)
      at org.mortbay.jetty.Server.doStart(Server.java:222)
      at org.mortbay.component.AbstractLifeCycle.start(AbstractLifeCycle.java:40)
      at org.kuali.student.common.test.spring.ServiceTestClassRunner.startServer(ServiceTestClassRunner.java:235)
      at org.kuali.student.common.test.spring.ServiceTestClassRunner.run(ServiceTestClassRunner.java:249)
      at org.apache.maven.surefire.junit4.JUnit4TestSet.execute(JUnit4TestSet.java:53)
      at org.apache.maven.surefire.junit4.JUnit4Provider.executeTestSet(JUnit4Provider.java:119)
      at org.apache.maven.surefire.junit4.JUnit4Provider.invoke(JUnit4Provider.java:101)
      at sun.reflect.NativeMethodAccessorImpl.invoke0(Native Method)
      at sun.reflect.NativeMethodAccessorImpl.invoke(NativeMethodAccessorImpl.java:39)
      at sun.reflect.DelegatingMethodAccessorImpl.invoke(DelegatingMethodAccessorImpl.java:25)
      at java.lang.reflect.Method.invoke(Method.java:597)
      at org.apache.maven.surefire.booter.ProviderFactory$ClassLoaderProxy.invoke(ProviderFactory.java:103)
      at $Proxy0.invoke(Unknown Source)
      at org.apache.maven.surefire.booter.SurefireStarter.invokeProvider(SurefireStarter.java:150)
      at org.apache.maven.surefire.booter.SurefireStarter.runSuitesInProcess(SurefireStarter.java:74)
      at org.apache.maven.surefire.booter.ForkedBooter.main(ForkedBooter.java:69)
      Caused by: org.springframework.beans.PropertyBatchUpdateException; nested PropertyAccessExceptions (2) are:
      PropertyAccessException 1: org.springframework.beans.MethodInvocationException: Property 'bus' threw exception; nested exception is org.springframework.beans.factory.CannotLoadBeanClassException: Cannot find class [org.kuali.student.r1.common.validator.ValidatorFactory] for bean with name 'validatorFactory' defined in class path resource [atp-additional-context.xml]; nested exception is java.lang.ClassNotFoundException: org.kuali.student.r1.common.validator.ValidatorFactory
      PropertyAccessException 2: org.springframework.beans.MethodInvocationException: Property 'transportIds' threw exception; nested exception is org.springframework.beans.factory.CannotLoadBeanClassException: Cannot find class [org.kuali.student.r1.common.validator.ValidatorFactory] for bean with name 'validatorFactory' defined in class path resource [atp-additional-context.xml]; nested exception is java.lang.ClassNotFoundException: org.kuali.student.r1.common.validator.ValidatorFactory
      at org.springframework.beans.AbstractPropertyAccessor.setPropertyValues(AbstractPropertyAccessor.java:102)
      at org.springframework.beans.AbstractPropertyAccessor.setPropertyValues(AbstractPropertyAccessor.java:58)
      at org.springframework.beans.factory.support.AbstractAutowireCapableBeanFactory.applyPropertyValues(AbstractAutowireCapableBeanFactory.java:1393)
      ... 34 more
      404 [main] ERROR org.mortbay.log - Nested in org.springframework.beans.factory.BeanCreationException: Error creating bean with name 'org.apache.cxf.transport.servlet.ServletTransportFactory' defined in class path resource [META-INF/cxf/cxf-servlet.xml]: Error setting property values; nested exception is org.springframework.beans.PropertyBatchUpdateException; nested PropertyAccessExceptions (2) are:
      PropertyAccessException 1: org.springframework.beans.MethodInvocationException: Property 'bus' threw exception; nested exception is org.springframework.beans.factory.CannotLoadBeanClassException: Cannot find class [org.kuali.student.r1.common.validator.ValidatorFactory] for bean with name 'validatorFactory' defined in class path resource [atp-additional-context.xml]; nested exception is java.lang.ClassNotFoundException: org.kuali.student.r1.common.validator.ValidatorFactory
      PropertyAccessException 2: org.springframework.beans.MethodInvocationException: Property 'transportIds' threw exception; nested exception is org.springframework.beans.factory.CannotLoadBeanClassException: Cannot find class [org.kuali.student.r1.common.validator.ValidatorFactory] for bean with name 'validatorFactory' defined in class path resource [atp-additional-context.xml]; nested exception is java.lang.ClassNotFoundException: org.kuali.student.r1.common.validator.ValidatorFactory:
      org.springframework.beans.PropertyBatchUpdateException; nested PropertyAccessException details (2) are:
      PropertyAccessException 1:
      org.springframework.beans.MethodInvocationException: Property 'bus' threw exception; nested exception is org.springframework.beans.factory.CannotLoadBeanClassException: Cannot find class [org.kuali.student.r1.common.validator.ValidatorFactory] for bean with name 'validatorFactory' defined in class path resource [atp-additional-context.xml]; nested exception is java.lang.ClassNotFoundException: org.kuali.student.r1.common.validator.ValidatorFactory
      at org.springframework.beans.BeanWrapperImpl.setPropertyValue(BeanWrapperImpl.java:1167)
      at org.springframework.beans.BeanWrapperImpl.setPropertyValue(BeanWrapperImpl.java:924)
      at org.springframework.beans.AbstractPropertyAccessor.setPropertyValues(AbstractPropertyAccessor.java:76)
      at org.springframework.beans.AbstractPropertyAccessor.setPropertyValues(AbstractPropertyAccessor.java:58)
      at org.springframework.beans.factory.support.AbstractAutowireCapableBeanFactory.applyPropertyValues(AbstractAutowireCapableBeanFactory.java:1393)
      at org.springframework.beans.factory.support.AbstractAutowireCapableBeanFactory.populateBean(AbstractAutowireCapableBeanFactory.java:1118)
      at org.springframework.beans.factory.support.AbstractAutowireCapableBeanFactory.doCreateBean(AbstractAutowireCapableBeanFactory.java:517)
      at org.springframework.beans.factory.support.AbstractAutowireCapableBeanFactory.createBean(AbstractAutowireCapableBeanFactory.java:456)
      at org.springframework.beans.factory.support.AbstractBeanFactory$1.getObject(AbstractBeanFactory.java:294)
      at org.springframework.beans.factory.support.DefaultSingletonBeanRegistry.getSingleton(DefaultSingletonBeanRegistry.java:225)
      at org.springframework.beans.factory.support.AbstractBeanFactory.doGetBean(AbstractBeanFactory.java:291)
      at org.springframework.beans.factory.support.AbstractBeanFactory.getBean(AbstractBeanFactory.java:193)
      at org.springframework.beans.factory.support.DefaultListableBeanFactory.preInstantiateSingletons(DefaultListableBeanFactory.java:585)
      at org.springframework.context.support.AbstractApplicationContext.finishBeanFactoryInitialization(AbstractApplicationContext.java:913)
      at org.springframework.context.support.AbstractApplicationContext.refresh(AbstractApplicationContext.java:464)
      at org.springframework.web.context.ContextLoader.configureAndRefreshWebApplicationContext(ContextLoader.java:384)
      at org.springframework.web.context.ContextLoader.initWebApplicationContext(ContextLoader.java:283)
      at org.springframework.web.context.ContextLoaderListener.contextInitialized(ContextLoaderListener.java:111)
      at org.mortbay.jetty.handler.ContextHandler.startContext(ContextHandler.java:539)
      at org.mortbay.jetty.servlet.Context.startContext(Context.java:135)
      at org.mortbay.jetty.handler.ContextHandler.doStart(ContextHandler.java:509)
      at org.mortbay.component.AbstractLifeCycle.start(AbstractLifeCycle.java:40)
      at org.mortbay.jetty.handler.HandlerWrapper.doStart(HandlerWrapper.java:117)
      at org.mortbay.jetty.Server.doStart(Server.java:222)
      at org.mortbay.component.AbstractLifeCycle.start(AbstractLifeCycle.java:40)
      at org.kuali.student.common.test.spring.ServiceTestClassRunner.startServer(ServiceTestClassRunner.java:235)
      at org.kuali.student.common.test.spring.ServiceTestClassRunner.run(ServiceTestClassRunner.java:249)
      at org.apache.maven.surefire.junit4.JUnit4TestSet.execute(JUnit4TestSet.java:53)
      at org.apache.maven.surefire.junit4.JUnit4Provider.executeTestSet(JUnit4Provider.java:119)
      at org.apache.maven.surefire.junit4.JUnit4Provider.invoke(JUnit4Provider.java:101)
      at sun.reflect.NativeMethodAccessorImpl.invoke0(Native Method)
      at sun.reflect.NativeMethodAccessorImpl.invoke(NativeMethodAccessorImpl.java:39)
      at sun.reflect.DelegatingMethodAccessorImpl.invoke(DelegatingMethodAccessorImpl.java:25)
      at java.lang.reflect.Method.invoke(Method.java:597)
      at org.apache.maven.surefire.booter.ProviderFactory$ClassLoaderProxy.invoke(ProviderFactory.java:103)
      at $Proxy0.invoke(Unknown Source)
      at org.apache.maven.surefire.booter.SurefireStarter.invokeProvider(SurefireStarter.java:150)
      at org.apache.maven.surefire.booter.SurefireStarter.runSuitesInProcess(SurefireStarter.java:74)
      at org.apache.maven.surefire.booter.ForkedBooter.main(ForkedBooter.java:69)
      Caused by: org.springframework.beans.factory.CannotLoadBeanClassException: Cannot find class [org.kuali.student.r1.common.validator.ValidatorFactory] for bean with name 'validatorFactory' defined in class path resource [atp-additional-context.xml]; nested exception is java.lang.ClassNotFoundException: org.kuali.student.r1.common.validator.ValidatorFactory
      at org.springframework.beans.factory.support.AbstractBeanFactory.resolveBeanClass(AbstractBeanFactory.java:1262)
      at org.springframework.beans.factory.support.AbstractAutowireCapableBeanFactory.predictBeanType(AbstractAutowireCapableBeanFactory.java:576)
      at org.springframework.beans.factory.support.AbstractBeanFactory.isFactoryBean(AbstractBeanFactory.java:1331)
      at org.springframework.beans.factory.support.DefaultListableBeanFactory.getBeanNamesForType(DefaultListableBeanFactory.java:317)
      at org.springframework.beans.factory.support.DefaultListableBeanFactory.getBeansOfType(DefaultListableBeanFactory.java:396)
      at org.springframework.context.support.AbstractApplicationContext.getBeansOfType(AbstractApplicationContext.java:1164)
      at org.apache.cxf.bus.spring.SpringBeanLocator.getBeansOfType(SpringBeanLocator.java:59)
      at org.apache.cxf.bus.CXFBusImpl.getExtension(CXFBusImpl.java:99)
      at org.apache.cxf.transport.AbstractTransportFactory.register(AbstractTransportFactory.java:72)
      at org.apache.cxf.transport.AbstractTransportFactory.setBus(AbstractTransportFactory.java:50)
      at org.apache.cxf.transport.servlet.ServletTransportFactory.setBus(ServletTransportFactory.java:73)
      at sun.reflect.NativeMethodAccessorImpl.invoke0(Native Method)
      at sun.reflect.NativeMethodAccessorImpl.invoke(NativeMethodAccessorImpl.java:39)
      at sun.reflect.DelegatingMethodAccessorImpl.invoke(DelegatingMethodAccessorImpl.java:25)
      at java.lang.reflect.Method.invoke(Method.java:597)
      at org.springframework.beans.BeanWrapperImpl.setPropertyValue(BeanWrapperImpl.java:1154)
      ... 38 more
      Caused by: java.lang.ClassNotFoundException: org.kuali.student.r1.common.validator.ValidatorFactory
      at java.net.URLClassLoader$1.run(URLClassLoader.java:202)
      at java.security.AccessController.doPrivileged(Native Method)
      at java.net.URLClassLoader.findClass(URLClassLoader.java:190)
      at java.lang.ClassLoader.loadClass(ClassLoader.java:307)
      at sun.misc.Launcher$AppClassLoader.loadClass(Launcher.java:301)
      at java.lang.ClassLoader.loadClass(ClassLoader.java:248)
      at org.springframework.util.ClassUtils.forName(ClassUtils.java:257)
      at org.springframework.beans.factory.support.AbstractBeanDefinition.resolveBeanClass(AbstractBeanDefinition.java:417)
      at org.springframework.beans.factory.support.AbstractBeanFactory.doResolveBeanClass(AbstractBeanFactory.java:1283)
      at org.springframework.beans.factory.support.AbstractBeanFactory.resolveBeanClass(AbstractBeanFactory.java:1254)
      ... 53 more
      PropertyAccessException 2:
      org.springframework.beans.MethodInvocationException: Property 'transportIds' threw exception; nested exception is org.springframework.beans.factory.CannotLoadBeanClassException: Cannot find class [org.kuali.student.r1.common.validator.ValidatorFactory] for bean with name 'validatorFactory' defined in class path resource [atp-additional-context.xml]; nested exception is java.lang.ClassNotFoundException: org.kuali.student.r1.common.validator.ValidatorFactory
      at org.springframework.beans.BeanWrapperImpl.setPropertyValue(BeanWrapperImpl.java:1167)
      at org.springframework.beans.BeanWrapperImpl.setPropertyValue(BeanWrapperImpl.java:924)
      at org.springframework.beans.AbstractPropertyAccessor.setPropertyValues(AbstractPropertyAccessor.java:76)
      at org.springframework.beans.AbstractPropertyAccessor.setPropertyValues(AbstractPropertyAccessor.java:58)
      at org.springframework.beans.factory.support.AbstractAutowireCapableBeanFactory.applyPropertyValues(AbstractAutowireCapableBeanFactory.java:1393)
      at org.springframework.beans.factory.support.AbstractAutowireCapableBeanFactory.populateBean(AbstractAutowireCapableBeanFactory.java:1118)
      at org.springframework.beans.factory.support.AbstractAutowireCapableBeanFactory.doCreateBean(AbstractAutowireCapableBeanFactory.java:517)
      at org.springframework.beans.factory.support.AbstractAutowireCapableBeanFactory.createBean(AbstractAutowireCapableBeanFactory.java:456)
      at org.springframework.beans.factory.support.AbstractBeanFactory$1.getObject(AbstractBeanFactory.java:294)
      at org.springframework.beans.factory.support.DefaultSingletonBeanRegistry.getSingleton(DefaultSingletonBeanRegistry.java:225)
      at org.springframework.beans.factory.support.AbstractBeanFactory.doGetBean(AbstractBeanFactory.java:291)
      at org.springframework.beans.factory.support.AbstractBeanFactory.getBean(AbstractBeanFactory.java:193)
      at org.springframework.beans.factory.support.DefaultListableBeanFactory.preInstantiateSingletons(DefaultListableBeanFactory.java:585)
      at org.springframework.context.support.AbstractApplicationContext.finishBeanFactoryInitialization(AbstractApplicationContext.java:913)
      at org.springframework.context.support.AbstractApplicationContext.refresh(AbstractApplicationContext.java:464)
      at org.springframework.web.context.ContextLoader.configureAndRefreshWebApplicationContext(ContextLoader.java:384)
      at org.springframework.web.context.ContextLoader.initWebApplicationContext(ContextLoader.java:283)
      at org.springframework.web.context.ContextLoaderListener.contextInitialized(ContextLoaderListener.java:111)
      at org.mortbay.jetty.handler.ContextHandler.startContext(ContextHandler.java:539)
      at org.mortbay.jetty.servlet.Context.startContext(Context.java:135)
      at org.mortbay.jetty.handler.ContextHandler.doStart(ContextHandler.java:509)
      at org.mortbay.component.AbstractLifeCycle.start(AbstractLifeCycle.java:40)
      at org.mortbay.jetty.handler.HandlerWrapper.doStart(HandlerWrapper.java:117)
      at org.mortbay.jetty.Server.doStart(Server.java:222)
      at org.mortbay.component.AbstractLifeCycle.start(AbstractLifeCycle.java:40)
      at org.kuali.student.common.test.spring.ServiceTestClassRunner.startServer(ServiceTestClassRunner.java:235)
      at org.kuali.student.common.test.spring.ServiceTestClassRunner.run(ServiceTestClassRunner.java:249)
      at org.apache.maven.surefire.junit4.JUnit4TestSet.execute(JUnit4TestSet.java:53)
      at org.apache.maven.surefire.junit4.JUnit4Provider.executeTestSet(JUnit4Provider.java:119)
      at org.apache.maven.surefire.junit4.JUnit4Provider.invoke(JUnit4Provider.java:101)
      at sun.reflect.NativeMethodAccessorImpl.invoke0(Native Method)
      at sun.reflect.NativeMethodAccessorImpl.invoke(NativeMethodAccessorImpl.java:39)
      at sun.reflect.DelegatingMethodAccessorImpl.invoke(DelegatingMethodAccessorImpl.java:25)
      at java.lang.reflect.Method.invoke(Method.java:597)
      at org.apache.maven.surefire.booter.ProviderFactory$ClassLoaderProxy.invoke(ProviderFactory.java:103)
      at $Proxy0.invoke(Unknown Source)
      at org.apache.maven.surefire.booter.SurefireStarter.invokeProvider(SurefireStarter.java:150)
      at org.apache.maven.surefire.booter.SurefireStarter.runSuitesInProcess(SurefireStarter.java:74)
      at org.apache.maven.surefire.booter.ForkedBooter.main(ForkedBooter.java:69)
      Caused by: org.springframework.beans.factory.CannotLoadBeanClassException: Cannot find class [org.kuali.student.r1.common.validator.ValidatorFactory] for bean with name 'validatorFactory' defined in class path resource [atp-additional-context.xml]; nested exception is java.lang.ClassNotFoundException: org.kuali.student.r1.common.validator.ValidatorFactory
      at org.springframework.beans.factory.support.AbstractBeanFactory.resolveBeanClass(AbstractBeanFactory.java:1262)
      at org.springframework.beans.factory.support.AbstractAutowireCapableBeanFactory.predictBeanType(AbstractAutowireCapableBeanFactory.java:576)
      at org.springframework.beans.factory.support.AbstractBeanFactory.isFactoryBean(AbstractBeanFactory.java:1331)
      at org.springframework.beans.factory.support.DefaultListableBeanFactory.getBeanNamesForType(DefaultListableBeanFactory.java:317)
      at org.springframework.beans.factory.support.DefaultListableBeanFactory.getBeansOfType(DefaultListableBeanFactory.java:396)
      at org.springframework.context.support.AbstractApplicationContext.getBeansOfType(AbstractApplicationContext.java:1164)
      at org.apache.cxf.bus.spring.SpringBeanLocator.getBeansOfType(SpringBeanLocator.java:59)
      at org.apache.cxf.bus.CXFBusImpl.getExtension(CXFBusImpl.java:99)
      at org.apache.cxf.transport.AbstractTransportFactory.unregister(AbstractTransportFactory.java:93)
      at org.apache.cxf.transport.AbstractTransportFactory.setTransportIds(AbstractTransportFactory.java:58)
      at sun.reflect.NativeMethodAccessorImpl.invoke0(Native Method)
      at sun.reflect.NativeMethodAccessorImpl.invoke(NativeMethodAccessorImpl.java:39)
      at sun.reflect.DelegatingMethodAccessorImpl.invoke(DelegatingMethodAccessorImpl.java:25)
      at java.lang.reflect.Method.invoke(Method.java:597)
      at org.springframework.beans.BeanWrapperImpl.setPropertyValue(BeanWrapperImpl.java:1154)
      ... 38 more
      Caused by: java.lang.ClassNotFoundException: org.kuali.student.r1.common.validator.ValidatorFactory
      at java.net.URLClassLoader$1.run(URLClassLoader.java:202)
      at java.security.AccessController.doPrivileged(Native Method)
      at java.net.URLClassLoader.findClass(URLClassLoader.java:190)
      at java.lang.ClassLoader.loadClass(ClassLoader.java:307)
      at sun.misc.Launcher$AppClassLoader.loadClass(Launcher.java:301)
      at java.lang.ClassLoader.loadClass(ClassLoader.java:248)
      at org.springframework.util.ClassUtils.forName(ClassUtils.java:257)
      at org.springframework.beans.factory.support.AbstractBeanDefinition.resolveBeanClass(AbstractBeanDefinition.java:417)
      at org.springframework.beans.factory.support.AbstractBeanFactory.doResolveBeanClass(AbstractBeanFactory.java:1283)
      at org.springframework.beans.factory.support.AbstractBeanFactory.resolveBeanClass(AbstractBeanFactory.java:1254)
      ... 52 more
      Tests run: 2, Failures: 0, Errors: 2, Skipped: 0, Time elapsed: 3.237 sec <<< FAILURE!

        Activity

          People

          • Assignee:
            Unassigned
            Reporter:
            Nina Gelderbloem (Inactive)
          • Votes:
            0 Vote for this issue
            Watchers:
            1 Start watching this issue

            Dates

            • Created:
              Updated:
              Resolved:

              Structure Helper Panel