Details

    • Type: Bug Fix Bug Fix
    • Status: Closed Closed
    • Priority: Blocker Blocker
    • Resolution: Fixed
    • Affects Version/s: None
    • Fix Version/s: 2.5.3
    • Component/s: Development
    • Security Level: Public (Public: Anyone can view)
    • Labels:
    • Similar issues:
      KULRICE-13759Fail CI AFT job if deploy target it depends upon fails, experienced with http://ci.rice.kuali.org/job/rice-2.5-test-functional-env14-jenkins-krad-sampleapp/93/
      KULRICE-12355Third-party license check CI job failing
      KULRICE-4116CI test are failing intermittently
      KULRICE-6812ValidationIntegrationTest failing on oracle
      KULRICE-14158ci job java.lang.NullPointerException failure
      KULRICE-13085Delete Rice 2.5 AFT failed CI builds from jobs
      KULRICE-14119Update regression test job to improve ci analysis
      KULRICE-12560Setup 2.4 & 2.5 CI Jobs
      KULRICE-12567Setup 2.5 CI Jobs
      KULRICE-13354AFT 2.5 env14 deploy job sometimes fail with build errors
    • Sprint:
      Middleware 2.5.2 Sprint 4, Middleware 2.5.2 Sprint 5, Rice Sprint 2015-02-18
    • KAI Review Status:
      Not Required
    • KTI Review Status:
      Not Required
    • Code Review Status:
      Not Required
    • Story Points:
      2

      Description

      After Kuali Commons upgrade, the rice-2.6-docbook-install started failing.

      [DEBUG] file intro_to_uif.xml has a filtered file extension
      [DEBUG] filtering /ssd/jenkins/workspace/rice-2.6-docbook-install/src/site/docbook/KRAD_Guide/intro_to_uif.xml to /ssd/jenkins/workspace/rice-2.6-docbook-install/target/docbook-filtered/KRAD_Guide/intro_to_uif.xml
      [INFO] ------------------------------------------------------------------------
      [INFO] BUILD FAILURE
      [INFO] ------------------------------------------------------------------------
      [INFO] Total time: 26.042 s
      [INFO] Finished at: 2015-01-24T14:55:57+00:00
      [INFO] Final Memory: 13M/137M
      [INFO] ------------------------------------------------------------------------
      [ERROR] Failed to execute goal org.apache.maven.plugins:maven-resources-plugin:2.7:copy-resources (filter-documentation-source) on project rice: Mark invalid -> [Help 1]
      org.apache.maven.lifecycle.LifecycleExecutionException: Failed to execute goal org.apache.maven.plugins:maven-resources-plugin:2.7:copy-resources (filter-documentation-source) on project rice: Mark invalid
      at org.apache.maven.lifecycle.internal.MojoExecutor.execute(MojoExecutor.java:216)

      I tested changed filtering to false in the pom and the test succeeded, but more testing needs to be done.

      Changes were made based on stackoverflow.com/questions/26281322/mavenfailed-to-execute-goal-org-apache-maven-pluginsmaven-resources-plugin2-7.

        Issue Links

          Activity

          Hide
          Jeff Ruch added a comment -

          Updated the pom.xml on rice-playground and resolved the issue.

          I still can't reproduce this locally. I updated Maven and also did a Maven clean build to ensure that my Kuali Common resources were up to date. Unfortunately, the mvn pre-site -N still works locally.

          I went ahead and tested it locally with the filtering turned off. I checked the file counts and sizes of the target directory and looks at a handful of the documents. Everything looks the same.

          I completed a pull request to master. Once merged, I will verify that the job succeeds before closing.

          Show
          Jeff Ruch added a comment - Updated the pom.xml on rice-playground and resolved the issue. I still can't reproduce this locally. I updated Maven and also did a Maven clean build to ensure that my Kuali Common resources were up to date. Unfortunately, the mvn pre-site -N still works locally. I went ahead and tested it locally with the filtering turned off. I checked the file counts and sizes of the target directory and looks at a handful of the documents. Everything looks the same. I completed a pull request to master. Once merged, I will verify that the job succeeds before closing.
          Hide
          Claus Niesen added a comment - - edited

          We still need to fix this in order to run the rice-2.5-release-sitedeploy job for the 2.5.2 release which updates the http://www.kuali.org/download/rice.

          Show
          Claus Niesen added a comment - - edited We still need to fix this in order to run the rice-2.5-release-sitedeploy job for the 2.5.2 release which updates the http://www.kuali.org/download/rice .
          Hide
          Jeff Ruch added a comment -

          Completed pull request for rice-2.5. Ran the docbooks job manually this morning.

          Show
          Jeff Ruch added a comment - Completed pull request for rice-2.5. Ran the docbooks job manually this morning.
          Hide
          Jeff Ruch added a comment -

          Pull request wasn't merged yet. Pending merge.

          Show
          Jeff Ruch added a comment - Pull request wasn't merged yet. Pending merge.
          Hide
          Jeff Ruch added a comment -

          The 2.5 pull request was merged, and I confirmed the fix.

          Show
          Jeff Ruch added a comment - The 2.5 pull request was merged, and I confirmed the fix.

            People

            • Assignee:
              Jeff Ruch
              Reporter:
              Martin Taylor (Inactive)
            • Votes:
              0 Vote for this issue
              Watchers:
              2 Start watching this issue

              Dates

              • Created:
                Updated:
                Resolved:

                Agile

                  Structure Helper Panel